test_total (tests.test_app.AppTests.test_total) ... FAIL

======================================================================
FAIL: test_total (tests.test_app.AppTests.test_total)
----------------------------------------------------------------------
Traceback (most recent call last):
  File "/mnt/data/PSMR_Runtime_MVP_v0.7/demo_dynamic/bad_logic_workspace/projection_candidates/candidate_231fd07cd36ff4dcfa09/source/tests/test_app.py", line 6, in test_total
    self.assertEqual(calculate_total(10, 2), 12)
    ~~~~~~~~~~~~~~~~^^^^^^^^^^^^^^^^^^^^^^^^^^^^
AssertionError: 13 != 12

----------------------------------------------------------------------
Ran 1 test in 0.008s

FAILED (failures=1)
